Author Topic: DPO7254 Failed SPC  (Read 147 times)

0 Members and 1 Guest are viewing this topic.

Offline charlydTopic starter

  • Frequent Contributor
  • **
  • Posts: 528
  • Country: nl
DPO7254 Failed SPC
« on: June 10, 2024, 12:54:36 pm »
hi i have an other DPO7254 with failing spc but this time it is channel related looking at the log output

Code: [Select]

***************************************

File opened:  Mon Jun 10 17:05:28 2024

***************************************

Start kernel driver initialization.

Scope.exe RELEASE build.

17:05:28:203[304] CDriverApi::drvOpen(265) MODERATE:CreateFile fail, Error code=2
setAcqBrdConfig: with board ID is 29
setAcqBrdConfig: with board ID is 29
=======This is a Stingray RevD/512 board with 8 demuxes========
=======Version ID: Tekscope 1.2.1d, MIA 0x10011156, ACL 0xAC140707=======

flashAccessInit MiaNV; Flash ID = 0x00202012; size = 0x040000
flashAccessInit AcqNV; Flash ID = 0x00202012; size = 0x040000
Start hardware account initialization.
Event log has 201 entries
17:05:28:656[304] hwAccount.cpp:hwAccount_init(2017) MODERATE:hDigital acq board ID not supported
17:05:29:750[304] nvPublic.cpp:nvFlashGetMinimal(629) MODERATE:nvFlashGet: there is no entry in the MiaNV flash
17:05:29:750[304] flMgr.cpp:flMgrInit(228) MODERATE:failed to read floating licenses
Start hardware access initialization.
Atmel clock src has been programmed successfully
Signature of acq processor firmware is 7EA0
Acq processor code successfully verified
17:05:30:968[304] hwConnect.cpp:hwAccessInit(1266) U7(LMX2326PLL) was detected successfully (re)locked 1 times after waiting 0.01ms.
CH2 signal not safe with 10.042145 volts RMS
CH3 signal not safe with 17.296415 volts RMS
17:05:31:406[304] CDmxPublic::powerUpCal(123) Starting analog demux pll/dll and memory calibration
DRAM is Mt_ddr2_512M_667
17:05:31:937[304] CDmxPublic::powerUpCal(226) ADG387 demuxs have been calibrated at 166MHz sysClk

Dram Calibration results:
-------------------------
DramCal has PASSED on all Demuxs

17:05:31:984[304] CDmxPublic::powerUpCal(123) Starting analog demux pll/dll and memory calibration
DRAM is Mt_ddr2_512M_667
17:05:32:718[304] CDmxPublic::powerUpCal(226) ADG387 demuxs have been calibrated at 166MHz sysClk

Dram Calibration results:
-------------------------
DramCal has PASSED on all Demuxs

Connecting trace interface to Error Log.
17:05:35:156[304] genHorzConstraints.cpp:generateHorizConstraintTables(956) Generating horz constraint tables.

8.33 ... 16.67 ... 17:05:35:296[304] genHorzConstraints.cpp:generateHorizConstraintTables(959)
Done generating tables.
17:05:35:296[304] acqUpStatsTimer.cpp:acqDsyUpStatsCreateTimer(79) acqDsyUpStatsTimerHandler
Calling appInterface.init
17:05:35:562[304] mathNetMgr::Init(141) mathNetMgrHandler
17:05:35:750[304] gpibControlLayer.cpp:GpibInitialize(4482) MODERATE:GpibInitialize: Initializing 6 parsers
Factory date: Wed Apr 28 12:34:39 2010

CH2 signal not safe with 10.044672 volts RMS
CH3 signal not safe with 17.100451 volts RMS
SPC date: Tue Feb 06 15:13:02 2024

CAL: SPC failedSPC status is not pass
17:05:39:593[304] tmgrclass.cpp:TmgrStartup(1903) tmgrTaskInit
Calling rtlStartup.
17:05:40:203[304] acqDsyNetMgrPublic.cpp:rtlStartup(442) rtlPMsgReceiver
Running diagnostics.
EnablePowerupDiags = 1, puMode=User
DiagPowerUpDiagsEnabled = 1
    Model: DPO7254
    Serial number: C010200, HFD201[0] ID = 45946 (0x00B37A)
    Scope.exe Version: 5.3.5 Build 22; Mon Jun 10 17:05:40 2024: Executing Powerup diags ... Pu=68 T=43C
Test "111" - Processor-->Memory-->DRAMWalk1 started
     Test execution time 8.9397e-006 sec
Test "112" - Processor-->Memory-->DRAMCell started
     Test execution time 0.0025668 sec
Test "113" - Processor-->Memory-->DRAMMarch  started
     Test execution time 0.0016125 sec
Test "114" - Processor-->Memory-->DRAMCal  started
     Test execution time 1.2851e-005 sec
Test "211" - Registers-->PCI-->MIA started
     Test execution time 0.00016902 sec
Test "221" - Registers-->Acquisition-->ACL started
     Test execution time 0.00019416 sec
Test "222" - Registers-->Acquisition-->PLL started
     Test execution time 0.031214 sec
Test "223" - Registers-->Acquisition-->Preamp started
     Test execution time 0.0043313 sec
Test "224" - Registers-->Acquisition-->TrkHld started
     Test execution time 0.0028411 sec
Test "225" - Registers-->Acquisition-->ADC started
     Test execution time 0.014742 sec
Test "226" - Registers-->Acquisition-->DAC started
     Test execution time 0.0046696 sec
Test "227" - Registers-->Acquisition-->Demux started
     Test execution time 0.0039681 sec
Test "231" - Registers-->Trigger-->SBTL started
     Test execution time 8.7721e-005 sec
Test "232" - Registers-->Trigger-->SGTL started
     Test execution time 0.0066067 sec
Test "233" - Registers-->Trigger-->TrigComp started
     Test execution time 8.381e-005 sec
Test "234" - Registers-->Trigger-->CommTrig started
     Test execution time 0.033595 sec
Test "235" - Registers-->Trigger-->FTL started
       *** TEST N/A FOR THIS HW ***
     Test execution time 1.6762e-006 sec
Test "241" - Registers-->Misc-->FanCtrl started
       *** TEST N/A FOR THIS HW ***
     Test execution time 1.6762e-006 sec
Test "242" - Registers-->Misc-->Tek04 started
       *** TEST N/A FOR THIS HW ***
     Test execution time 1.9556e-006 sec
Test "243" - Registers-->Misc-->DigCtrl started
       *** TEST N/A FOR THIS HW ***
     Test execution time 1.6762e-006 sec
Test "244" - Registers-->Misc-->IntfBoard started
       *** TEST N/A FOR THIS HW ***
     Test execution time 1.9556e-006 sec
Test "245" - Registers-->Misc-->FpBoard started
       *** TEST N/A FOR THIS HW ***
     Test execution time 1.6762e-006 sec
Test "246" - Registers-->Misc-->AfeBoard started
       *** TEST N/A FOR THIS HW ***
     Test execution time 1.6762e-006 sec
Test "252" - Registers-->DigitalTrig-->Tek05Dev started
       *** TEST N/A FOR THIS HW ***
     Test execution time 1.9556e-006 sec
Test "253" - Registers-->DigitalTrig-->Tek05HKRam started
       *** TEST N/A FOR THIS HW ***
     Test execution time 1.6762e-006 sec
Test "254" - Registers-->DigitalTrig-->Tek05AcqRam started
       *** TEST N/A FOR THIS HW ***
     Test execution time 1.6762e-006 sec
Test "311" - Acquisition-->Demux-->RunAB started
     Test execution time 0.25198 sec
Test "312" - Acquisition-->Demux-->AcqDone started
     Test execution time 0.00176 sec
Test "313" - Acquisition-->Demux-->SysRdy started
     Test execution time 0.0013178 sec
Test "314" - Acquisition-->Demux-->Interrupt started
     Test execution time 0.0015561 sec
Test "315" - Acquisition-->Demux-->IdcLoSpeed started
     Test execution time 0.0040826 sec
Test "316" - Acquisition-->Demux-->IdcHiSpeed started
     Test execution time 0.43784 sec
Test "317" - Acquisition-->Demux-->IdcAcqDataXfr started
     Test execution time 0.0035574 sec
Test "318" - Acquisition-->Demux-->IdcDispDataXfr started
     Test execution time 0.0033582 sec
Test "321" - Acquisition-->Dma-->PaDma started
To reduce analog paDma User/RTC Looping Mode powerup time, nBytesToXfr reduced from 268435456 to 1048576.
17:05:41:578[556] testDmxPublicCmds.cpp:tstDiagPaDma(628) U11_0_A(DMX[0]) PASSED tstDiagSSPaDma.
17:05:41:593[556] testDmxPublicCmds.cpp:tstDiagPaDma(628) U11_1_A(DMX[1]) PASSED tstDiagSSPaDma.
17:05:41:625[556] testDmxPublicCmds.cpp:tstDiagPaDma(628) U11_0_B(DMX[2]) PASSED tstDiagSSPaDma.
17:05:41:656[556] testDmxPublicCmds.cpp:tstDiagPaDma(628) U11_1_B(DMX[3]) PASSED tstDiagSSPaDma.
17:05:41:671[556] testDmxPublicCmds.cpp:tstDiagPaDma(628) U11_0_C(DMX[4]) PASSED tstDiagSSPaDma.
17:05:41:703[556] testDmxPublicCmds.cpp:tstDiagPaDma(628) U11_1_C(DMX[5]) PASSED tstDiagSSPaDma.
17:05:41:734[556] testDmxPublicCmds.cpp:tstDiagPaDma(628) U11_0_D(DMX[6]) PASSED tstDiagSSPaDma.
17:05:41:750[556] testDmxPublicCmds.cpp:tstDiagPaDma(628) U11_1_D(DMX[7]) PASSED tstDiagSSPaDma.
     Test execution time 0.22896 sec
Test "322" - Acquisition-->Dma-->IdcAcqDma started
     Test execution time 0.0060781 sec
Test "331" - Acquisition-->Memory-->MemData started
     Test execution time 0.022042 sec
Test "332" - Acquisition-->Memory-->MemAddr started
     Test execution time 0.0043293 sec
Test "342" - Acquisition-->Vertical-->TH Inputs started
     Test execution time 0.31688 sec
Test "345" - Acquisition-->Vertical-->50ohmOvld started
     Test execution time 0.87153 sec
Test "351" - Acquisition-->PLL-->Clock Freq started
17:05:43:671[556] acqDiagPublicCmds.cpp:diagInitPLL(2511) U7(LMX2326PLL) was detected successfully (re)locked 1 times after waiting 0.01ms.
     Test execution time 0.65627 sec
Test "371" - Acquisition-->AcqProcessor-->SPI started
     Test execution time 0.0001489 sec
Test "372" - Acquisition-->AcqProcessor-->INT Line started
     Test execution time 0.00060455 sec
Test "373" - Acquisition-->AcqProcessor-->Interrupt started
17:05:43:734[1948] acqprocDevice.cpp:ServeAcqProcessor(1505) MODERATE:AcqProc Receiver spawned
17:05:43:734[1948] acqprocDevice.cpp:dispatchAcqProcEvent(1432) Relay positions stabilized
     Test execution time 0.0021028 sec
Test "374" - Acquisition-->AcqProcessor-->RelayDrive started
17:05:43:734[1948] acqprocDevice.cpp:resyncAcqProcState(111) Acq processor booted
       *** TEST N/A FOR THIS HW ***
     Test execution time 3.3524e-006 sec
Test "375" - Acquisition-->AcqProcessor-->TWI started
     Test execution time 0.00014834 sec
Test "376" - Acquisition-->AcqProcessor-->PrbInterrupts started
     Test execution time 0.00039614 sec
Test "377" - Acquisition-->AcqProcessor-->TCpowerCtrl started
       *** TEST N/A FOR THIS HW ***
     Test execution time 1.9556e-006 sec
Test "378" - Acquisition-->AcqProcessor-->MAX517 started
     Test execution time 0.00095403 sec
Test "411" - Trigger-->Inputs-->Ch1 started
     Test execution time 0.15692 sec
Test "412" - Trigger-->Inputs-->Ch2 started
     Test execution time 0.15672 sec
Test "413" - Trigger-->Inputs-->Ch3 started
     Test execution time 0.1568 sec
Test "414" - Trigger-->Inputs-->Ch4 started
     Test execution time 0.15676 sec
Test "415" - Trigger-->Inputs-->Line started
     Test execution time 0.016503 sec
Test "416" - Trigger-->Inputs-->Video started
     Test execution time 0.19179 sec
Test "417" - Trigger-->Inputs-->Events started
     Test execution time 0.3125 sec
Test "418" - Trigger-->Inputs-->Serial started
     Test execution time 0.37486 sec
Test "419" - Trigger-->Inputs-->HSMeta started
       *** TEST N/A FOR THIS HW ***
     Test execution time 1.9556e-006 sec
Test "421" - Trigger-->Outputs-->523TrgOut started
     Test execution time 0.00052828 sec
Test "422" - Trigger-->Outputs-->523CpuInt started
     Test execution time 0.00046961 sec
Test "423" - Trigger-->Outputs-->Fedge started
     Test execution time 0.065792 sec
Test "424" - Trigger-->Outputs-->Ftrig started
     Test execution time 0.065872 sec
Test "441" - Trigger-->Word-->Compare started
       *** TEST N/A FOR THIS HW ***
     Test execution time 1.9556e-006 sec
Test "442" - Trigger-->Word-->Delay started
       *** TEST N/A FOR THIS HW ***
     Test execution time 1.9556e-006 sec
Test "443" - Trigger-->Word-->Clk Qualify started
       *** TEST N/A FOR THIS HW ***
     Test execution time 1.9556e-006 sec
Test "444" - Trigger-->Word-->Formed LSST started
       *** TEST N/A FOR THIS HW ***
     Test execution time 1.9556e-006 sec
Test "451" - Trigger-->Digital-->Acq started
       *** TEST N/A FOR THIS HW ***
     Test execution time 1.3968e-006 sec
Mon Jun 10 17:05:45 2024: USER MODE POWERUP DIAGNOSTICS RESULTS: 18 (of 67) tests SKIPPED
Mon Jun 10 17:05:45 2024: USER MODE POWERUP DIAGNOSTICS RESULTS: ALL 49 EXECUTED TESTS PASSED
17:05:45:750[556] diagMgr.cpp:calDiagManager(948) Powerup diags finished in 5.5312 sec
<< POWERUP DIAGS FINISHED >>
17:05:45:921[304] calMisc.cpp:calWarmUpSetup(612) calWarmUpThread
17:05:46:750[304] CAppEventDispatcher::init(640) The queue was created, name 'D'
Found grammar package file TekAppDDRAPackage.v2.dll
Got package Ptr 0B26AED0
Loaded packageId 31
Found grammar package file TekAppDPOJitPackage.v2.dll
Got package Ptr 0C060CB0
Loaded packageId 32
DRAM is Mt_ddr2_512M_667

Dram Calibration results:
-------------------------
DramCal has PASSED on all Demuxs

DRAM is Mt_ddr2_512M_667

Dram Calibration results:
-------------------------
DramCal has PASSED on all Demuxs

system init done.
------- VERSION INFO -------
"5.3.5 Build 22"
  RTL version
     Expected = "5.3.5.22"
     Actual   = "5.3.5.22"
  UI version
     Expected = "5.3.5.22"
     Actual   = "Unknown - UI not Started"
----------------------------

================================================================
SYSTEM INFORMATION:
    Stingray
    Model: DPO7254
    Serial number: C010200
    Scope.exe Version: 5.3.5 Build 22;     RELEASE
    Diagnostics:
        Powerup mode: USER
        Powerups Count: 68
    Timed Demo Info: Timed Demo, 0 days left.
    Options:
        ASM: Advanced Search & Mark
        LT: Limit Test
        App 75 Avail
         not installed.
       
    Hardware Configuration:
        CPU Board Id: 1, 1
        Windows Driver version: 1021D
        MIA Image version: 10011156
        ACL4 Image version: AC140707
        Number of channels: 4
        Acq board RevD/512
        DEMUXES PRESENT: 8 DEMUXES IN USE: 8
        ATODS PRESENT: 4 ATODS IN USE: 4
        Track and Holds: 1
        ACQ MEM: 536870912
        ACQ BW: 2500
        ACQ SAMPLE RATE: 5000
        DEMUX ASIC REV: 0
        FTL PRESENT: 0
            Max Recovd Clk:      1.25e+009
            CalFilter support:   0
            BWE Support:         1
            CF StandardBits:     0x00000000
            BWE Bandwidth:       2.500e+009
            BWE SampleRate:      1.000e+010
            IsVista:             0
================================================================
    system configuration flags
     PREAMP HFD144
     PREAMP M668
     50 ohm termination
     1 meg ohm termination
     Attenuator 10x
     CLock Recovery
     Advanced Search
     Limit Test
     Trigger Video
acquireData2 failed

ERROR (0xffffffff): digPhaseCal failed
Mon Jun 10 17:06:56 2024: DIAGNOSTIC EXECUTION starting ... Pu=68 T=44C
Test "111" - Processor-->Memory-->DRAMWalk1 started
     Test execution time 2.7937e-006 sec
Test "112" - Processor-->Memory-->DRAMCell started
     Test execution time 0.0024981 sec
Test "113" - Processor-->Memory-->DRAMMarch  started
     Test execution time 0.0016033 sec
Test "114" - Processor-->Memory-->DRAMCal  started
     Test execution time 2.2349e-006 sec
Test "211" - Registers-->PCI-->MIA started
     Test execution time 0.00016203 sec
Test "221" - Registers-->Acquisition-->ACL started
     Test execution time 0.00019137 sec
Test "222" - Registers-->Acquisition-->PLL started
     Test execution time 0.023161 sec
Test "223" - Registers-->Acquisition-->Preamp started
     Test execution time 0.26807 sec
Test "224" - Registers-->Acquisition-->TrkHld started
     Test execution time 0.087773 sec
Test "225" - Registers-->Acquisition-->ADC started
     Test execution time 0.014718 sec
Test "226" - Registers-->Acquisition-->DAC started
     Test execution time 0.0047372 sec
Test "227" - Registers-->Acquisition-->Demux started
     Test execution time 0.003893 sec
Test "231" - Registers-->Trigger-->SBTL started
     Test execution time 8.8e-005 sec
Test "232" - Registers-->Trigger-->SGTL started
     Test execution time 0.012632 sec
Test "233" - Registers-->Trigger-->TrigComp started
     Test execution time 7.5987e-005 sec
Test "234" - Registers-->Trigger-->CommTrig started
     Test execution time 0.036461 sec
Test "235" - Registers-->Trigger-->FTL started
       *** TEST N/A FOR THIS HW ***
     Test execution time 1.6762e-006 sec
Test "241" - Registers-->Misc-->FanCtrl started
       *** TEST N/A FOR THIS HW ***
     Test execution time 1.6762e-006 sec
Test "242" - Registers-->Misc-->Tek04 started
       *** TEST N/A FOR THIS HW ***
     Test execution time 2.5143e-006 sec
Test "243" - Registers-->Misc-->DigCtrl started
       *** TEST N/A FOR THIS HW ***
     Test execution time 1.6762e-006 sec
Test "244" - Registers-->Misc-->IntfBoard started
       *** TEST N/A FOR THIS HW ***
     Test execution time 1.6762e-006 sec
Test "245" - Registers-->Misc-->FpBoard started
       *** TEST N/A FOR THIS HW ***
     Test execution time 1.6762e-006 sec
Test "246" - Registers-->Misc-->AfeBoard started
       *** TEST N/A FOR THIS HW ***
     Test execution time 1.3968e-006 sec
Test "251" - Registers-->DigitalTrig-->Tek05Dfe started
       *** TEST N/A FOR THIS HW ***
     Test execution time 2.2349e-006 sec
Test "252" - Registers-->DigitalTrig-->Tek05Dev started
       *** TEST N/A FOR THIS HW ***
     Test execution time 1.6762e-006 sec
Test "253" - Registers-->DigitalTrig-->Tek05HKRam started
       *** TEST N/A FOR THIS HW ***
     Test execution time 1.6762e-006 sec
Test "254" - Registers-->DigitalTrig-->Tek05AcqRam started
       *** TEST N/A FOR THIS HW ***
     Test execution time 1.3968e-006 sec
Test "311" - Acquisition-->Demux-->RunAB started
     Test execution time 0.2603 sec
Test "312" - Acquisition-->Demux-->AcqDone started
     Test execution time 0.0017499 sec
Test "313" - Acquisition-->Demux-->SysRdy started
     Test execution time 0.0012979 sec
Test "314" - Acquisition-->Demux-->Interrupt started
     Test execution time 0.0015449 sec
Test "315" - Acquisition-->Demux-->IdcLoSpeed started
     Test execution time 0.0040835 sec
Test "316" - Acquisition-->Demux-->IdcHiSpeed started
     Test execution time 0.42478 sec
Test "317" - Acquisition-->Demux-->IdcAcqDataXfr started
     Test execution time 0.0035454 sec
Test "318" - Acquisition-->Demux-->IdcDispDataXfr started
     Test execution time 0.0033432 sec
Test "321" - Acquisition-->Dma-->PaDma started
17:07:04:593[556] testDmxPublicCmds.cpp:tstDiagPaDma(628) U11_0_A(DMX[0]) PASSED tstDiagSSPaDma.
17:07:10:703[556] testDmxPublicCmds.cpp:tstDiagPaDma(628) U11_1_A(DMX[1]) PASSED tstDiagSSPaDma.
17:07:16:796[556] testDmxPublicCmds.cpp:tstDiagPaDma(628) U11_0_B(DMX[2]) PASSED tstDiagSSPaDma.
17:07:22:906[556] testDmxPublicCmds.cpp:tstDiagPaDma(628) U11_1_B(DMX[3]) PASSED tstDiagSSPaDma.
17:07:29:000[556] testDmxPublicCmds.cpp:tstDiagPaDma(628) U11_0_C(DMX[4]) PASSED tstDiagSSPaDma.
17:07:35:109[556] testDmxPublicCmds.cpp:tstDiagPaDma(628) U11_1_C(DMX[5]) PASSED tstDiagSSPaDma.
17:07:41:218[556] testDmxPublicCmds.cpp:tstDiagPaDma(628) U11_0_D(DMX[6]) PASSED tstDiagSSPaDma.
17:07:47:312[556] testDmxPublicCmds.cpp:tstDiagPaDma(628) U11_1_D(DMX[7]) PASSED tstDiagSSPaDma.
     Test execution time 48.859 sec
Test "322" - Acquisition-->Dma-->IdcAcqDma started
     Test execution time 0.0057541 sec
Test "331" - Acquisition-->Memory-->MemData started
     Test execution time 0.022108 sec
Test "332" - Acquisition-->Memory-->MemAddr started
     Test execution time 0.0041458 sec
Test "333" - Acquisition-->Memory-->MemSpeed started
17:07:50:234[556] acqDiagConf.cpp:digSpeedTester(220) digSpeedMemDiag (U11_0_A(DMX[0])) passed at 100.00106750400f nominal clock speed.
17:07:53:093[556] acqDiagConf.cpp:digSpeedTester(220) digSpeedMemDiag (U11_1_A(DMX[1])) passed at 100.00106750400f nominal clock speed.
17:07:55:953[556] acqDiagConf.cpp:digSpeedTester(220) digSpeedMemDiag (U11_0_B(DMX[2])) passed at 100.00106750400f nominal clock speed.
17:07:58:812[556] acqDiagConf.cpp:digSpeedTester(220) digSpeedMemDiag (U11_1_B(DMX[3])) passed at 100.00106750400f nominal clock speed.
17:08:01:671[556] acqDiagConf.cpp:digSpeedTester(220) digSpeedMemDiag (U11_0_C(DMX[4])) passed at 100.00106750400f nominal clock speed.
17:08:04:531[556] acqDiagConf.cpp:digSpeedTester(220) digSpeedMemDiag (U11_1_C(DMX[5])) passed at 100.00106750400f nominal clock speed.
17:08:07:406[556] acqDiagConf.cpp:digSpeedTester(220) digSpeedMemDiag (U11_0_D(DMX[6])) passed at 100.00106750400f nominal clock speed.
17:08:10:250[556] acqDiagConf.cpp:digSpeedTester(220) digSpeedMemDiag (U11_1_D(DMX[7])) passed at 100.00106750400f nominal clock speed.
     Test execution time 22.923 sec
Test "341" - Acquisition-->Vertical-->Preamp Inputs started
       *** TEST NOT RUN YET ***
     Test execution time 0.00012851 sec
Test "342" - Acquisition-->Vertical-->TH Inputs started
     Test execution time 0.3134 sec
Test "343" - Acquisition-->Vertical-->ADC Inputs started
     Test execution time 1.1835 sec
Test "344" - Acquisition-->Vertical-->ADC Outputs started
     Test execution time 2.2344 sec
Test "345" - Acquisition-->Vertical-->50ohmOvld started
     Test execution time 0.88689 sec
Test "346" - Acquisition-->Vertical-->LFComp started
     Test execution time 1.1036 sec
Test "351" - Acquisition-->PLL-->Clock Freq started
     Test execution time 0.66748 sec
Test "361" - Acquisition-->HFSource-->SINE started
HFSource:SINE:INTLV_CAL_VCO_N CH1 failed, amplitude too low (Act delta:4.356e-002; hi:2.376e-002 lo:-1.980e-002; Exp Delta min:1.720e-001)
*** Show 1000 Bytes @ 0x00000000 - acquired data ***
Address+: 07 06 05 04 03 02 01 00
00000000: fa 00 04 fe fc 03 01 fa
00000008: ff fb 03 06 fc fb 05 01
00000010: 07 fe fc 03 00 fb fe 05
00000018: 03 06 fa fd 05 01 fb 00
00000020: fc 01 03 fb ff 06 fd fb
00000028: fa fc 05 01 fb ff 05 fd
00000030: 02 fc ff 06 ff fa 03 06
00000038: 04 01 fb fe 05 ff fb 02
00000040: ff 06 fe fa 03 05 fb fb
00000048: f9 fe 07 fe fb 03 03 fc
00000050: ff fb 02 06 fb fd 06 03
00000058: 05 ff fb 00 03 fc ff 03
00000060: 03 04 fa fb 06 04 fb fe
00000068: fa 03 02 fa fe 05 ff f9
00000070: fb fa 05 01 fa fe 05 ff
00000078: 04 fc fc 04 01 fb 01 06
00000080: 04 03 fb fe 06 ff fb 01
00000088: fd 04 00 fb 01 06 fe fc
00000090: fb fe 06 ff fa 00 04 fc
00000098: 00 fa 01 06 fe fa 04 03
000000a0: 05 01 fc 00 04 fb fc 05
000000a8: 02 06 fd fc 04 05 fa fc
000000b0: fb 00 05 fc fd 04 ff fc
000000b8: ff f9 04 03 fa fd 06 00
000000c0: 05 fe fd 04 00 fd 00 05
000000c8: 02 04 fb fc 06 00 f9 00
000000d0: fb 02 02 fc ff 05 fd fa
000000d8: fb fc 06 00 fa 00 04 fc
000000e0: 00 f9 ff 06 fd fa 02 05
000000e8: 06 00 fb ff 05 fe fd 03
000000f0: ff 04 ff fa 02 05 fc fc
000000f8: fb 00 05 fe fb 02 02 fc
00000100: ff f9 02 05 fd fb 06 01
00000108: 05 ff fb 02 02 fc fd 05
00000110: 03 07 fc fc 05 01 f9 ff
00000118: fa 03 04 fb fe 04 fe fb
00000120: fc fb 05 03 f9 fe 06 fe
00000128: 02 fb fd 05 01 f9 00 05
00000130: 05 04 fa ff 06 ff fa 03
00000138: fe 06 fe fa 01 04 fb f9
00000140: fc ff 06 ff fa 02 03 fc
00000148: 00 f9 01 07 fb fb 05 02
00000150: 06 00 fa 02 04 fd ff 05
00000158: 00 05 fc fc 05 03 fb fe
00000160: fb 03 04 fd fd 04 00 fa
00000168: fd fc 04 03 fb fd 06 ff
00000170: 04 fc fd 04 01 fa 00 06
00000178: 04 04 fb fc 06 00 fa 00
00000180: fd 05 01 fb 00 06 fe fc
00000188: fb fd 06 00 fb 00 06 fd
00000190: 02 fa 00 05 fe fb 03 03
00000198: 06 01 fa ff 06 fc fd 03
000001a0: ff 05 fd f9 03 04 fb fb
000001a8: fa ff 05 fe fc 04 02 fa
000001b0: fd fa 03 06 fa fb 05 01
000001b8: 05 fe fc 03 02 fc ff 05
000001c0: 03 05 fa fb 05 01 f9 ff
000001c8: fb 01 02 fb ff 05 ff fc
000001d0: fc fc 04 03 fa 00 05 ff
000001d8: 02 fc fe 04 ff fa 02 05
000001e0: 05 03 fb ff 05 fe fa 02
000001e8: fe 06 ff fa 02 06 fa fc
000001f0: fa fe 06 fd fa 01 02 fb
000001f8: ff fa 01 06 fb fd 06 03
00000200: 06 ff fb 01 03 fb fe 05
00000208: 01 05 fc fb 05 03 fa ff
00000210: fb 01 03 fb fe 04 ff fb
00000218: fb fb 04 02 fa fe 05 ff
00000220: 05 fd fc 06 00 fb 01 07
00000228: 05 04 fb fe 06 00 fa 01
00000230: fd 05 00 f9 ff 06 fd fb
00000238: fb fe 06 00 f9 00 05 fc
00000240: 00 fa 00 06 fd fb 04 05
00000248: 06 00 fa 00 04 fc fe 05
00000250: 00 07 fd fa 04 04 fa fe
00000258: f8 00 04 fc fd 04 00 fb
00000260: ff fb 03 04 fb fd 05 ff
00000268: 04 fe fb 03 01 f9 ff 06
00000270: 02 05 fc fc 06 02 fb 00
00000278: fd 04 02 fb fe 06 fe fc
00000280: fa fc 06 00 fa ff 05 ff
00000288: 02 fb ff 05 fe fa 02 04
00000290: 04 03 fa 00 06 fd fb 02
00000298: ff 05 fe f9 04 05 fb fc
000002a0: fb fe 05 fe fb 05 00 fb
000002a8: fe fa 02 05 fc fc 04 02
000002b0: 06 ff fc 03 04 fc fe 05
000002b8: 02 05 fc fc 07 03 f9 fe
000002c0: fa 03 04 fd fe 04 ff fb
000002c8: fb fb 04 02 f9 fe 07 ff
000002d0: 03 fb ff 03 00 fb 02 05
000002d8: 05 03 fc fe 06 ff fc 01
000002e0: fe 05 ff fb 00 05 fb fc
000002e8: fb fc 05 ff fb 02 03 fc
000002f0: 00 fa 01 05 fb fb 03 03
000002f8: 06 ff fb 00 04 fd fe 04
00000300: ff 06 fd fd 04 03 fc fe
00000308: fb 01 04 fc ff 04 01 fb
00000310: fd fb 03 04 fa fc 07 ff
00000318: 04 fe fd 04 00 f9 00 04
00000320: 04 04 fa fe 05 00 fa 00
00000328: fc 04 ff fc 00 05 fd f9
00000330: fb fc 06 00 fb 00 06 fc
00000338: 01 fb ff 06 fe fb 02 06
00000340: 06 00 fa ff 05 fd fb 03
00000348: ff 04 fd fb 02 05 fd fd
00000350: fa ff 06 fe fe 03 01 fb
00000358: fe fc 03 06 fc fc 06 01
00000360: 06 fe fb 02 02 fb ff 06
00000368: 03 05 fb fb 06 01 fb ff
00000370: fa 01 03 fc ff 05 fe fb
00000378: fb fc 06 02 fb 00 05 fe
00000380: 04 fb ff 04 ff fa 02 05
00000388: 05 03 fb ff 05 00 fb 01
00000390: fe 05 ff fa 02 05 fc fb
00000398: fa ff 06 ff fb 01 03 fb
000003a0: ff fc 02 05 fb fb 04 04
000003a8: 06 fe fb 02 03 fc fe 06
000003b0: 00 04 fe fb 05 03 f9 fe
000003b8: fa 02 04 fc fd 04 00 f9
000003c0: fd fa 05 02 fb fe 06 00
000003c8: 03 fe fd 04 ff fb 00 06
000003d0: 04 03 fb fd 06 00 fb 02
000003d8: fd 03 01 fb 00 06 fc fb
000003e0: fb ff 05 00 fb 00 05 fc
       *** TEST FAILED ***
     Test execution time 0.28251 sec
diagMgr:diagLogFailure: Mon Jun 10 17:06:56 2024 D Pu=68 T=44 "HFSource:SINE:INTLV_CAL_VCO_N CH1 failed, amplitude too low (Act delta:4.356e-002; hi:2.376e-002 lo:-1.980e-002; Exp Delta min:1.720e-001)"
Test "362" - Acquisition-->HFSource-->SINE33 started
HFSource:SINE33:ACQ_PHASE_CAL_CLK CH1 failed, amplitude too low (Act delta:5.544e-002; hi:2.772e-002 lo:-2.772e-002; Exp Delta min:2.680e-001)
*** Show 1000 Bytes @ 0x00000000 - acquired data ***
Address+: 07 06 05 04 03 02 01 00
00000000: fa fa f9 f9 f9 f9 fa fa
00000008: f9 f9 f9 f8 f8 f9 f9 f9
00000010: fc f8 fb f9 fa fa fa f9
00000018: fe fb fd f7 fc fa fc f9
00000020: 01 fc 01 fa ff fb ff f9
00000028: 05 fe 03 ff 02 fc 02 fc
00000030: 07 00 06 00 06 ff 06 fe
00000038: 08 04 08 03 07 02 08 05
00000040: 08 06 08 06 08 06 08 05
00000048: 07 07 08 07 07 09 09 07
00000050: 05 08 05 08 06 08 06 06
00000058: 04 07 05 07 04 07 05 07
00000060: 02 07 03 06 03 07 02 07
00000068: ff 05 ff 04 fe 05 02 06
00000070: fc 00 fc 01 fd 03 fe 03
00000078: fb ff fa 00 fb 00 fc 01
00000080: f8 fb fa fc f9 fd f9 ff
00000088: f8 fb f9 fb f9 fc f8 fc
00000090: f7 fa f9 fa f9 fa f9 f9
00000098: f8 f8 f9 fa f8 f9 f8 f9
000000a0: fa f8 f8 f9 fa fa f9 f9
000000a8: fc f9 fa fa fc fa fb f9
000000b0: ff fa ff fa fd fa fd f8
000000b8: 03 fc 02 fb 01 fd 01 fb
000000c0: 05 fe 05 ff 03 fd 03 fd
000000c8: 07 01 05 01 05 01 04 ff
000000d0: 08 05 08 04 08 02 07 02
000000d8: 07 07 08 08 08 05 09 06
000000e0: 07 08 07 09 09 08 09 07
000000e8: 05 08 03 07 06 07 08 09
000000f0: 03 07 03 06 03 06 05 08
000000f8: 00 04 01 06 01 06 02 04
00000100: fd 02 fd 04 ff 04 00 06
00000108: fb 00 fd 01 fb 00 fd 03
00000110: f9 fe fa ff f9 00 fa 00
00000118: f9 fb f8 fd fc fc f9 ff
00000120: f8 fb fa fb f9 fc f8 fc
00000128: f9 fa f9 f9 f8 f9 f9 f8
00000130: fa f9 f9 f9 f8 f9 f9 fa
00000138: fa f9 f9 f7 f9 f9 fa f9
00000140: fd f9 fd f8 fb f8 fa f8
00000148: ff fa fe fa ff f9 fd fa
00000150: 04 fc 02 fb 02 fb 01 fb
00000158: 05 ff 05 fe 05 ff 06 fd
00000160: 09 02 07 02 07 01 07 02
00000168: 07 05 08 05 07 02 09 03
00000170: 07 09 07 07 07 06 09 06
00000178: 05 09 06 08 09 07 07 07
00000180: 05 07 05 07 07 07 06 09
00000188: 03 07 04 05 04 07 05 08
00000190: ff 04 00 05 ff 05 01 05
00000198: fd 01 fd 03 ff 02 01 04
000001a0: fa ff fb 01 fc 02 fc 03
000001a8: fa fe f8 fe fa ff fa ff
000001b0: f9 fc f9 fc fa fc f9 fe
000001b8: f9 fa f8 fa f7 fa f8 f9
000001c0: f8 f9 f9 f8 f9 f8 f8 fa
000001c8: f8 f9 f9 f9 f9 fa f9 f9
000001d0: fd fa fa f8 fa f9 f9 f9
000001d8: fc f9 fc fb fc f8 fd f8
000001e0: 00 fa 01 fa ff fa fe fa
000001e8: 03 fe 03 fd 02 fb 01 fc
000001f0: 04 00 07 ff 05 ff 05 fe
000001f8: 08 03 07 02 07 02 06 01
00000200: 08 06 07 06 0a 05 09 05
00000208: 07 09 06 06 09 07 08 06
00000210: 05 07 06 08 06 06 07 06
00000218: 04 07 04 08 05 06 04 08
00000220: 01 07 03 06 03 05 03 07
00000228: ff 05 ff 05 00 05 01 06
00000230: fd 02 fd 01 fc 03 fc 04
00000238: fb ff fa 00 fb 00 fc 01
00000240: f9 fd fa fc fb fe fa ff
00000248: fa fb f9 fb f8 fb f9 fc
00000250: f8 f9 fa f9 f8 fb f9 fa
00000258: f9 f9 f9 f8 f9 f9 f8 fa
00000260: fb f9 fb f7 f9 fa f8 f9
00000268: fc f8 fa f8 fa f9 fa f8
00000270: fe fb fe fb fe fa fd f9
00000278: 01 fc 00 fc 00 fb ff f9
00000280: 03 ff 03 fe 03 fc 03 fb
00000288: 07 02 08 00 05 ff 04 00
00000290: 08 04 07 03 08 02 06 01
00000298: 08 06 07 05 08 03 07 03
000002a0: 07 08 08 08 07 06 07 06
000002a8: 06 07 06 07 07 07 06 07
000002b0: 03 08 05 07 03 07 06 09
000002b8: 01 05 02 06 02 06 03 07
000002c0: fe 03 ff 05 00 06 ff 05
000002c8: fc 01 fd 02 fd 02 fd 03
000002d0: fa ff fc ff fb 00 fc 01
000002d8: f9 fd f9 fb fa fc fa ff
000002e0: f7 fb fa fc fa fb f9 fc
000002e8: fa fb fa f9 f9 fb f9 fa
000002f0: fa fa f9 f9 f8 f8 f8 f9
000002f8: f9 f9 f9 fa fa f9 fa f7
00000300: fd f9 fc f9 fb f9 fb f8
00000308: ff fa ff fa 00 fa fd fa
00000310: 02 fc 03 fb 00 fb 00 fc
00000318: 05 ff 05 fe 04 fc 03 fb
00000320: 07 02 07 00 06 00 06 ff
00000328: 09 04 07 03 07 02 08 03
00000330: 08 07 08 05 07 05 08 06
00000338: 07 08 07 08 07 07 08 07
00000340: 05 06 06 07 06 07 06 07
00000348: 04 06 03 07 05 06 05 07
00000350: ff 04 01 06 01 05 03 05
00000358: fe 03 ff 04 fe 05 00 05
00000360: fb 00 fd 02 fc 03 ff 02
00000368: f9 ff fa ff fa 00 fa 00
00000370: f8 fc f8 fc f9 fc fa fc
00000378: f9 fa f8 fa f8 fa f9 fc
00000380: fa fb f8 fa f9 f8 f9 fb
00000388: fa f9 fa fa f9 fb f8 fa
00000390: fb f9 fc f7 fa f7 fa fa
00000398: fd f9 fd f9 fc f8 fc f9
000003a0: 00 fa fe f9 ff f9 fd f9
000003a8: 03 fe 02 fc 02 fb ff fb
000003b0: 06 ff 04 ff 03 fe 05 fe
000003b8: 06 01 08 03 07 01 05 00
000003c0: 09 05 08 04 09 03 06 03
000003c8: 07 06 08 06 08 07 07 06
000003d0: 07 08 08 06 07 06 06 08
000003d8: 05 06 05 09 05 06 05 08
000003e0: 03 06 02 07 04 08 05 06
       *** TEST FAILED ***
     Test execution time 0.22442 sec
diagMgr:diagLogFailure: Mon Jun 10 17:06:56 2024 D Pu=68 T=44 "HFSource:SINE33:ACQ_PHASE_CAL_CLK CH1 failed, amplitude too low (Act delta:5.544e-002; hi:2.772e-002 lo:-2.772e-002; Exp Delta min:2.680e-001)"
Test "363" - Acquisition-->HFSource-->SQUARE started
     Test execution time 0.087198 sec
Test "371" - Acquisition-->AcqProcessor-->SPI started
     Test execution time 0.00014499 sec
Test "372" - Acquisition-->AcqProcessor-->INT Line started
     Test execution time 0.00063304 sec
Test "373" - Acquisition-->AcqProcessor-->Interrupt started
     Test execution time 0.00039446 sec
Test "374" - Acquisition-->AcqProcessor-->RelayDrive started
       *** TEST N/A FOR THIS HW ***
     Test execution time 1.9556e-006 sec
Test "375" - Acquisition-->AcqProcessor-->TWI started
     Test execution time 0.00014052 sec
Test "376" - Acquisition-->AcqProcessor-->PrbInterrupts started
     Test execution time 0.00031848 sec
Test "377" - Acquisition-->AcqProcessor-->TCpowerCtrl started
       *** TEST N/A FOR THIS HW ***
     Test execution time 1.6762e-006 sec
Test "378" - Acquisition-->AcqProcessor-->MAX517 started
     Test execution time 0.00095738 sec
Test "411" - Trigger-->Inputs-->Ch1 started
     Test execution time 0.15371 sec
Test "412" - Trigger-->Inputs-->Ch2 started
     Test execution time 0.15594 sec
Test "413" - Trigger-->Inputs-->Ch3 started
     Test execution time 0.1561 sec
Test "414" - Trigger-->Inputs-->Ch4 started
     Test execution time 0.15574 sec
Test "415" - Trigger-->Inputs-->Line started
     Test execution time 0.0069188 sec
Test "416" - Trigger-->Inputs-->Video started
     Test execution time 0.19903 sec
Test "417" - Trigger-->Inputs-->Events started
     Test execution time 0.30839 sec
Test "418" - Trigger-->Inputs-->Serial started
     Test execution time 0.37453 sec
Test "419" - Trigger-->Inputs-->HSMeta started
       *** TEST N/A FOR THIS HW ***
     Test execution time 1.9556e-006 sec
Test "421" - Trigger-->Outputs-->523TrgOut started
     Test execution time 0.00052102 sec
Test "422" - Trigger-->Outputs-->523CpuInt started
     Test execution time 0.00046207 sec
Test "423" - Trigger-->Outputs-->Fedge started
     Test execution time 0.061968 sec
Test "424" - Trigger-->Outputs-->Ftrig started
     Test execution time 0.061577 sec
Test "425" - Trigger-->Outputs-->TrigInfo started
     Test execution time 0.7305 sec
Test "431" - Trigger-->Timers-->Delay started
     Test execution time 0.14488 sec
Test "432" - Trigger-->Timers-->Delta started
     Test execution time 0.061553 sec
Test "433" - Trigger-->Timers-->Holdoff started
     Test execution time 0.1269 sec
Test "434" - Trigger-->Timers-->PostTrig started
     Test execution time 0.19941 sec
Test "435" - Trigger-->Timers-->PreTrig started
     Test execution time 0.071252 sec
Test "436" - Trigger-->Timers-->Timeout started
     Test execution time 0.068931 sec
Test "441" - Trigger-->Word-->Compare started
       *** TEST N/A FOR THIS HW ***
     Test execution time 2.7937e-006 sec
Test "442" - Trigger-->Word-->Delay started
       *** TEST N/A FOR THIS HW ***
     Test execution time 1.6762e-006 sec
Test "443" - Trigger-->Word-->Clk Qualify started
       *** TEST N/A FOR THIS HW ***
     Test execution time 1.6762e-006 sec
Test "444" - Trigger-->Word-->Formed LSST started
       *** TEST N/A FOR THIS HW ***
     Test execution time 1.6762e-006 sec
Test "451" - Trigger-->Digital-->Acq started
       *** TEST N/A FOR THIS HW ***
     Test execution time 2.5143e-006 sec
Test "511" - TekLink-->Topology -->Signals started
       *** TEST N/A FOR THIS HW ***
     Test execution time 0.0030842 sec
Test "521" - TekLink-->Trigger -->Path started
       *** TEST N/A FOR THIS HW ***
     Test execution time 2.7657e-005 sec
Test "522" - TekLink-->Trigger -->TiDone started
       *** TEST N/A FOR THIS HW ***
     Test execution time 1.6762e-006 sec
Test "531" - TekLink-->Reference -->Path started
       *** TEST N/A FOR THIS HW ***
     Test execution time 2.7937e-005 sec
Mon Jun 10 17:08:20 2024: DIAG MODE DIAGNOSTICS RESULTS: 24 (of 87) tests SKIPPED
Mon Jun 10 17:08:20 2024: DIAG MODE DIAGNOSTICS RESULTS: 2 (of 63) EXECUTED tests FAILED
Test 361 - F ==> Acquisition->HFSource->SINE, 0.28251 sec
HFSource:SINE:INTLV_CAL_VCO_N CH1 failed, amplitude too low (Act delta:4.356e-002; hi:2.376e-002 lo:-1.980e-002; Exp Delta min:1.720e-001)
Test 362 - F ==> Acquisition->HFSource->SINE33, 0.22442 sec
HFSource:SINE33:ACQ_PHASE_CAL_CLK CH1 failed, amplitude too low (Act delta:5.544e-002; hi:2.772e-002 lo:-2.772e-002; Exp Delta min:2.680e-001)
DIAGNOSTIC EXECUTION finished in 83.175 sec
DRAM is Mt_ddr2_512M_667

Dram Calibration results:
-------------------------
DramCal has PASSED on all Demuxs

DRAM is Mt_ddr2_512M_667

Dram Calibration results:
-------------------------
DramCal has PASSED on all Demuxs

acquireData2 failed

ERROR (0xffffffff): digPhaseCal failed



on the picture you see ch3 (purple) is throwing garbage on the screen for me it looks like issues on the ch3 input but i can not see anything about that in the logging above. The logging is pointing to low ampl. ch1 this looks strange to me

If the pre-amp is a suspect on a channel is it the red circled chip (see bottom picture) which needs to be replaced?

or is there a way to debug the inputs or let s us say: get more detailed logging from the channels?

can somebody confirm that?
« Last Edit: June 10, 2024, 03:52:27 pm by charlyd »
 


Share me

Digg  Facebook  SlashDot  Delicious  Technorati  Twitter  Google  Yahoo
Smf